Target
Estrogen receptor
Ligand
BDBM50346462
Substrate
Meas. Tech.
ChEMBL_751835 (CHEMBL1785590)
EC50
0.58±n/a nM
Citation
 Bertini, SDe Cupertinis, AGranchi, CBargagli, BTuccinardi, TMartinelli, AMacchia, MGunther, JRCarlson, KEKatzenellenbogen, JAMinutolo, F Selective and potent agonists for estrogen receptor beta derived from molecular refinements of salicylaldoximes. Eur J Med Chem 46:2453-62 (2011)  
Target
Name:
Estrogen receptor
Synonyms:
ER ESR ESR1_HUMAN Estrogen receptor Estrogen receptor (ER-alpha) Estrogen receptor alpha (ER) Nuclear receptor subfamily 3 group A member 1
Type:
Protein
Mol. Mass.:
66230.44
Organism:
Homo sapiens (Human)
Description:
P03372
Residue:
595
  
Inhibitor
Name:
BDBM50346462
Synonyms:
(E)-2-chloro-4,4'-dihydroxybiphenyl-3-carbaldehyde oxime | CHEMBL1782957
Type:
Small organic molecule
Emp. Form.:
C13H10ClNO3
Mol. Mass.:
263.676
SMILES:
Oc1ccc(cc1)-c1ccc(O)c(CN=O)c1Cl
: