Target
Estrogen receptor beta
Ligand
BDBM50346463
Substrate
Meas. Tech.
ChEMBL_751837 (CHEMBL1785592)
EC50
1.3±n/a nM
Citation
 Bertini, SDe Cupertinis, AGranchi, CBargagli, BTuccinardi, TMartinelli, AMacchia, MGunther, JRCarlson, KEKatzenellenbogen, JAMinutolo, F Selective and potent agonists for estrogen receptor beta derived from molecular refinements of salicylaldoximes. Eur J Med Chem 46:2453-62 (2011)  
Target
Name:
Estrogen receptor beta
Synonyms:
ER-beta ESR2_HUMAN Estradiol receptor beta (ERβ) Estrogen receptor (ER beta) Estrogen receptor beta (ER beta) NR3A2 estrogen beta
Type:
Protein
Mol. Mass.:
59238.43
Organism:
Homo sapiens (Human)
Description:
Q92731
Residue:
530
  
Inhibitor
Name:
BDBM50346463
Synonyms:
(E)-2-chloro-3'-fluoro-4,4'-dihydroxybiphenyl-3-carbaldehyde oxime | CHEMBL1782958
Type:
Small organic molecule
Emp. Form.:
C13H9ClFNO3
Mol. Mass.:
281.667
SMILES:
Oc1ccc(cc1F)-c1ccc(O)c(CN=O)c1Cl
: