Target
Fatty acid-binding protein, heart
Ligand
BDBM50346469
Substrate
Meas. Tech.
ChEMBL_751846 (CHEMBL1785601)
Ki
4240±n/a nM
Citation
 Liu, XHuang, XLin, WWang, DDiao, YLi, HHui, XWang, YXu, AWu, DKe, D New aromatic substituted pyrazoles as selective inhibitors of human adipocyte fatty acid-binding protein. Bioorg Med Chem Lett 21:2949-52 (2011)  
Target
Name:
Fatty acid-binding protein, heart
Synonyms:
FABP11 FABPH_HUMAN MDGI
Type:
PROTEIN
Mol. Mass.:
14858.36
Organism:
Homo sapiens (Human)
Description:
ChEMBL_1463784
Residue:
133
  
Inhibitor
Name:
BDBM50346469
Synonyms:
2-(2'-(1-(4-chlorophenyl)-5-(thiophen-2-yl)-1H-pyrazol-3-yl)biphenyl-3-yloxy)acetic acid | CHEMBL1782966
Type:
Small organic molecule
Emp. Form.:
C27H19ClN2O3S
Mol. Mass.:
486.969
SMILES:
OC(=O)COc1cccc(c1)-c1ccccc1-c1cc(-c2cccs2)n(n1)-c1ccc(Cl)cc1
: