Target
Calmodulin-1
Ligand
BDBM50346811
Substrate
Meas. Tech.
ChEMBL_753876 (CHEMBL1798138)
IC50
15020±n/a nM
Citation
 Reyes-Ramírez, ALeyte-Lugo, MFigueroa, MSerrano-Alba, TGonzález-Andrade, MMata, R Synthesis, biological evaluation, and docking studies of gigantol analogs as calmodulin inhibitors. Eur J Med Chem 46:2699-708 (2011)  
Target
Name:
Calmodulin-1
Synonyms:
CALM CALM1_HUMAN CAM CAM2 Calmodulin-2
Type:
Protein
Mol. Mass.:
16813.73
Organism:
Human
Description:
P0DP23
Residue:
149
  
Inhibitor
Name:
BDBM50346811
Synonyms:
CHEMBL1796022
Type:
Small organic molecule
Emp. Form.:
C13H12
Mol. Mass.:
168.2344
SMILES:
C(c1ccccc1)c1ccccc1
: