Target
Lysine-specific demethylase 4E
Ligand
BDBM26110
Substrate
Meas. Tech.
ChEMBL_754091 (CHEMBL1798569)
IC50
4800±n/a nM
Citation
 Lohse, BKristensen, JLKristensen, LHAgger, KHelin, KGajhede, MClausen, RP Inhibitors of histone demethylases. Bioorg Med Chem 19:3625-36 (2011)  
Target
Name:
Lysine-specific demethylase 4E
Synonyms:
2-OG-Dependent Histone Demethylase JMJD2E Jumonji domain-containing protein 2E (JMJD2E) KDM4DL KDM4E_HUMAN Lysine-specific demethylase 4E | Lysine-specific demethylase 4E (KDM4E)
Type:
Enzyme
Mol. Mass.:
56815.71
Organism:
Homo sapiens (Human)
Description:
B2RXH2
Residue:
506
  
Inhibitor
Name:
BDBM26110
Synonyms:
N,3-dihydroxybenzamide | aromatic hydroxamic acid, 5a
Type:
Small organic molecule
Emp. Form.:
C7H7NO3
Mol. Mass.:
153.1354
SMILES:
ONC(=O)c1cccc(O)c1
: