Target
Mitogen-activated protein kinase 3
Ligand
BDBM50346918
Substrate
Meas. Tech.
ChEMBL_753060 (CHEMBL1798988)
IC50
>10000±n/a nM
Citation
 Devadas, BSelness, SRXing, LMadsen, HMMarrufo, LDShieh, HMessing, DMYang, JZMorgan, HMAnderson, GDWebb, EGZhang, JDevraj, RVMonahan, JB Substituted N-aryl-6-pyrimidinones: a new class of potent, selective, and orally active p38 MAP kinase inhibitors. Bioorg Med Chem Lett 21:3856-60 (2011)  
Target
Name:
Mitogen-activated protein kinase 3
Synonyms:
ERK1 Extracellular signal-regulated kinase 1 MAP kinase ERK1 MAPK3/MAPK7 Mitogen-activated protein kinase PRKM3
Type:
Protein
Mol. Mass.:
43136.58
Organism:
Homo sapiens (Human)
Description:
curated by PDB 4QTB
Residue:
379
  
Inhibitor
Name:
BDBM50346918
Synonyms:
CHEMBL1738710
Type:
Small organic molecule
Emp. Form.:
C21H18ClF2N3O4
Mol. Mass.:
449.835
SMILES:
Cc1ccc(cc1-n1cnc(OCc2ccc(F)cc2F)c(Cl)c1=O)C(=O)NCCO
: