Target
Dual specificity mitogen-activated protein kinase kinase 7
Ligand
BDBM50346918
Substrate
Meas. Tech.
ChEMBL_753066 (CHEMBL1798994)
IC50
>10000±n/a nM
Citation
 Devadas, BSelness, SRXing, LMadsen, HMMarrufo, LDShieh, HMessing, DMYang, JZMorgan, HMAnderson, GDWebb, EGZhang, JDevraj, RVMonahan, JB Substituted N-aryl-6-pyrimidinones: a new class of potent, selective, and orally active p38 MAP kinase inhibitors. Bioorg Med Chem Lett 21:3856-60 (2011)  
Target
Name:
Dual specificity mitogen-activated protein kinase kinase 7
Synonyms:
Dual specificity mitogen-activated protein kinase kinase 7 JNKK2 MEK7 MP2K7_HUMAN SKK4
Type:
Protein
Mol. Mass.:
47502.52
Organism:
Homo sapiens (Human)
Description:
O14733
Residue:
419
  
Inhibitor
Name:
BDBM50346918
Synonyms:
CHEMBL1738710
Type:
Small organic molecule
Emp. Form.:
C21H18ClF2N3O4
Mol. Mass.:
449.835
SMILES:
Cc1ccc(cc1-n1cnc(OCc2ccc(F)cc2F)c(Cl)c1=O)C(=O)NCCO
: