Target
Serine/threonine-protein kinase mTOR
Ligand
BDBM50346964
Substrate
Meas. Tech.
ChEMBL_753273 (CHEMBL1799484)
EC50
30±n/a nM
Citation
 Liu, QWang, JKang, SAThoreen, CCHur, WChoi, HGWaller, DLSim, TSabatini, DMGray, NS Discovery and optimization of potent and selective benzonaphthyridinone analogs as small molecule mTOR inhibitors with improved mouse microsome stability. Bioorg Med Chem Lett 21:4036-40 (2011)  
Target
Name:
Serine/threonine-protein kinase mTOR
Synonyms:
FK506-binding protein 12-rapamycin complex-associated protein 1 Frap MTOR_MOUSE Mechanistic target of rapamycin RAPT1 Serine/threonine-protein kinase mTOR | Serine/threonine-protein kinase mTOR (mTOR)
Type:
Enzyme
Mol. Mass.:
288814.44
Organism:
Mus musculus (Mouse)
Description:
Q9JLN9
Residue:
2549
  
Inhibitor
Name:
BDBM50346964
Synonyms:
CHEMBL1795878
Type:
Small organic molecule
Emp. Form.:
C35H22F3N3O2
Mol. Mass.:
573.5633
SMILES:
OCc1ccc(cc1)-c1ccc(cc1C(F)(F)F)-n1c2c(ccc1=O)cnc1ccc(cc21)-c1cnc2ccccc2c1
: