Target
Serine/threonine-protein kinase mTOR
Ligand
BDBM50346974
Substrate
Meas. Tech.
ChEMBL_753273 (CHEMBL1799484)
EC50
>1000±n/a nM
Citation
 Liu, QWang, JKang, SAThoreen, CCHur, WChoi, HGWaller, DLSim, TSabatini, DMGray, NS Discovery and optimization of potent and selective benzonaphthyridinone analogs as small molecule mTOR inhibitors with improved mouse microsome stability. Bioorg Med Chem Lett 21:4036-40 (2011)  
Target
Name:
Serine/threonine-protein kinase mTOR
Synonyms:
FK506-binding protein 12-rapamycin complex-associated protein 1 Frap MTOR_MOUSE Mechanistic target of rapamycin RAPT1 Serine/threonine-protein kinase mTOR | Serine/threonine-protein kinase mTOR (mTOR)
Type:
Enzyme
Mol. Mass.:
288814.44
Organism:
Mus musculus (Mouse)
Description:
Q9JLN9
Residue:
2549
  
Inhibitor
Name:
BDBM50346974
Synonyms:
CHEMBL1795888
Type:
Small organic molecule
Emp. Form.:
C32H30N4O2
Mol. Mass.:
502.6062
SMILES:
CN1CCC(CC1)NC(=O)c1ccc(cc1)-c1ccc(cc1C)-n1c2c(ccc1=O)cnc1ccccc21
: