Target
Sphingosine 1-phosphate receptor 3
Ligand
BDBM50347151
Substrate
Meas. Tech.
ChEMBL_753428 (CHEMBL1799858)
EC50
>10000±n/a nM
Citation
 Kurata, HKusumi, KOtsuki, KSuzuki, RKurono, MTakada, YShioya, HKomiya, TMizuno, HOno, THagiya, HMinami, MNakade, SHabashita, H Discovery of S1P agonists with a dihydronaphthalene scaffold. Bioorg Med Chem Lett 21:3885-9 (2011)  
Target
Name:
Sphingosine 1-phosphate receptor 3
Synonyms:
C9orf108 EDG3 S1P receptor 3 S1P3 S1PR3_HUMAN Sphingosine 1-phosphate receptor 3 (S1P3) | Sphingosine 1-phosphate receptor Edg-3
Type:
G Protein-Coupled Receptor (GPCR)
Mol. Mass.:
42278.13
Organism:
Homo sapiens (Human)
Description:
Q99500
Residue:
378
  
Inhibitor
Name:
BDBM50347151
Synonyms:
CHEMBL1797500
Type:
Small organic molecule
Emp. Form.:
C23H29NO3
Mol. Mass.:
367.4813
SMILES:
Cc1cc(\C=C\CNCCC(O)=O)ccc1OCCCCc1ccccc1
: