Target
Amine oxidase [flavin-containing] A
Ligand
BDBM50347296
Substrate
Meas. Tech.
ChEMBL_754274 (CHEMBL1798961)
Ki
130±n/a nM
Citation
 Jagrat, MBehera, JYabanoglu, SErcan, AUcar, GSinha, BNSankaran, VBasu, AJayaprakash, V Pyrazoline based MAO inhibitors: synthesis, biological evaluation and SAR studies. Bioorg Med Chem Lett 21:4296-300 (2011)  
Target
Name:
Amine oxidase [flavin-containing] A
Synonyms:
AOFA_HUMAN MAO-A Monoamine oxidase Monoamine oxidase type A (MAO A) Monoamine oxidase type A (MAOA)
Type:
Protein
Mol. Mass.:
59689.53
Organism:
Homo sapiens (Human)
Description:
P21397
Residue:
527
  
Inhibitor
Name:
BDBM50347296
Synonyms:
CHEMBL1796451
Type:
Small organic molecule
Emp. Form.:
C23H21N3OS
Mol. Mass.:
387.497
SMILES:
Cc1cccc(NC(=S)N2N=C(CC2c2ccc(O)cc2)c2ccccc2)c1
: