Target
Chitinase
Ligand
BDBM50063753
Substrate
Meas. Tech.
ChEMBL_756521 (CHEMBL1804594)
Ki
468±n/a nM
Citation
 Garner, ALGloeckner, CTricoche, NZakhari, JSSamje, MCho-Ngwa, FLustigman, SJanda, KD Design, synthesis, and biological activities of closantel analogues: structural promiscuity and its impact on Onchocerca volvulus. J Med Chem 54:3963-72 (2011)  
Target
Name:
Chitinase
Synonyms:
Type:
PROTEIN
Mol. Mass.:
55694.80
Organism:
Onchocerca volvulus
Description:
ChEMBL_1369100
Residue:
497
  
Inhibitor
Name:
BDBM50063753
Synonyms:
CHEMBL12131 N-(5-chloro-4-((4-chlorophenyl)(cyano)methyl)-2-methylphenyl)-2-hydroxy-3,5-diiodobenzamide cid_42574
Type:
Small organic molecule
Emp. Form.:
C22H14Cl2I2N2O2
Mol. Mass.:
663.074
SMILES:
Cc1cc(C(C#N)c2ccc(Cl)cc2)c(Cl)cc1NC(=O)c1cc(I)cc(I)c1O
: