Target
Dual specificity protein kinase CLK1
Ligand
BDBM50347762
Substrate
Meas. Tech.
ChEMBL_756288 (CHEMBL1805101)
IC50
220±n/a nM
Citation
 Debdab, MCarreaux, FRenault, SSoundararajan, MFedorov, OFilippakopoulos, PLozach, OBabault, LTahtouh, TBaratte, BOgawa, YHagiwara, MEisenreich, ARauch, UKnapp, SMeijer, LBazureau, JP Leucettines, a class of potent inhibitors of cdc2-like kinases and dual specificity, tyrosine phosphorylation regulated kinases derived from the marine sponge leucettamine B: modulation of alternative pre-RNA splicing. J Med Chem 54:4172-86 (2011)  
Target
Name:
Dual specificity protein kinase CLK1
Synonyms:
CDC-like kinase 1 Clk Protein kinase STY | Sty
Type:
PROTEIN
Mol. Mass.:
57124.52
Organism:
Mus musculus
Description:
ChEMBL_1502245
Residue:
483
  
Inhibitor
Name:
BDBM50347762
Synonyms:
CHEMBL1803073
Type:
Small organic molecule
Emp. Form.:
C20H17N3O5
Mol. Mass.:
379.3661
SMILES:
CN1C(=O)C(=Cc2ccc3OCOc3c2)N=C1Nc1ccc2OCCOc2c1
: