Target
Interferon-induced, double-stranded RNA-activated protein kinase
Ligand
BDBM7401
Substrate
Meas. Tech.
ChEMBL_756675 (CHEMBL1805140)
IC50
600±n/a nM
Citation
 Bryk, RWu, KRaimundo, BCBoardman, PEChao, PConn, GLAnderson, ECole, JLDuffy, NPNathan, CGriffin, JH Identification of new inhibitors of protein kinase R guided by statistical modeling. Bioorg Med Chem Lett 21:4108-14 (2011)  
Target
Name:
Interferon-induced, double-stranded RNA-activated protein kinase
Synonyms:
E2AK2_HUMAN Eukaryotic translation initiation factor 2-alpha kinase 2 P1/eIF-2A protein kinase PRKR Protein kinase RNA-activated eIF-2A protein kinase 2 | p68 kinase
Type:
PROTEIN
Mol. Mass.:
62104.61
Organism:
Homo sapiens (Human)
Description:
ChEMBL_1467743
Residue:
551
  
Inhibitor
Name:
BDBM7401
Synonyms:
(2 Z,3 E)-6-Bromoindirubin-3 -oxime 6-bromo-3-[(2Z,3E)-3-(hydroxyimino)-2,3-dihydro-1H-indol-2-ylidene]-2,3-dihydro-1H-indol-2-one 6BIO indirubin deriv. 7a
Type:
Small organic molecule
Emp. Form.:
C16H10BrN3O2
Mol. Mass.:
356.174
SMILES:
Brc1ccc2C(C(=O)Nc2c1)c1[nH]c2ccccc2c1N=O
: