Target
Carbonic anhydrase
Ligand
BDBM60986
Substrate
Meas. Tech.
ChEMBL_757508 (CHEMBL1804480)
Ki
9410±n/a nM
Citation
 Oztürk Sarikaya, SBTopal, FSentürk, MGülçin, ISupuran, CT In vitro inhibition ofa-carbonic anhydrase isozymes by some phenolic compounds. Bioorg Med Chem Lett 21:4259-62 (2011)  
Target
Name:
Carbonic anhydrase
Synonyms:
Type:
PROTEIN
Mol. Mass.:
32973.15
Organism:
Dicentrarchus labrax
Description:
ChEMBL_757508
Residue:
309
  
Inhibitor
Name:
BDBM60986
Synonyms:
MLS001335996 TANNIC ACID | cid_16129778
Type:
Small organic molecule
Emp. Form.:
C76H52O46
Mol. Mass.:
1701.1985
SMILES:
Oc1cc(cc(O)c1O)C(=O)Oc1cc(cc(O)c1O)C(=O)OC[C@H]1O[C@@H](OC(=O)c2cc(O)c(O)c(OC(=O)c3cc(O)c(O)c(O)c3)c2)[C@H](OC(=O)c2cc(O)c(O)c(OC(=O)c3cc(O)c(O)c(O)c3)c2)[C@@H](OC(=O)c2cc(O)c(O)c(OC(=O)c3cc(O)c(O)c(O)c3)c2)[C@@H]1OC(=O)c1cc(O)c(O)c(OC(=O)c2cc(O)c(O)c(O)c2)c1
: