Target
Acid-sensing ion channel 3
Ligand
BDBM50348100
Substrate
Meas. Tech.
ChEMBL_757561 (CHEMBL1804676)
IC50
6300±n/a nM
Citation
 Kuduk, SDChang, RKDi Marco, CNDipardo, RMCook, SPCato, MJJovanovska, AUrban, MOLeitl, MSpencer, RHKane, SAHartman, GDBilodeau, MT Identification of non-amidine inhibitors of acid-sensing ion channel-3 (ASIC3). Bioorg Med Chem Lett 21:4255-8 (2011)  
Target
Name:
Acid-sensing ion channel 3
Synonyms:
ACCN3 ASIC3_HUMAN SLNAC1 | TNAC1
Type:
PROTEIN
Mol. Mass.:
58910.26
Organism:
Homo sapiens (Human)
Description:
ChEMBL_757561
Residue:
531
  
Inhibitor
Name:
BDBM50348100
Synonyms:
CHEMBL1800332
Type:
Small organic molecule
Emp. Form.:
C19H14N2
Mol. Mass.:
270.3279
SMILES:
NC(=N)c1ccc2cc(ccc2c1)C#Cc1ccccc1
: