Target
Adenosine receptor A1
Ligand
BDBM50348155
Substrate
Meas. Tech.
ChEMBL_757189 (CHEMBL1803413)
Ki
1078±n/a nM
Citation
 Baraldi, PGPreti, DZaid, ANSaponaro, GTabrizi, MABaraldi, SRomagnoli, RMoorman, ARVarani, KCosconati, SDi Maro, SMarinelli, LNovellino, EBorea, PA New 2-heterocyclyl-imidazo[2,1-i]purin-5-one derivatives as potent and selective human A3 adenosine receptor antagonists. J Med Chem 54:5205-20 (2011)  
Target
Name:
Adenosine receptor A1
Synonyms:
A1 adenosine receptor (hA1) AA1R_HUMAN ADORA1 Adenosine A1-receptor Adenosine receptor A1 (hA1) | Adenosine transporter (AdT)
Type:
G Protein-Coupled Receptor (GPCR)
Mol. Mass.:
36520.92
Organism:
Homo sapiens (Human)
Description:
P30542
Residue:
326
  
Inhibitor
Name:
BDBM50348155
Synonyms:
CHEMBL1800784
Type:
Small organic molecule
Emp. Form.:
C17H21N7O2
Mol. Mass.:
355.3943
SMILES:
CC[C@H]1Cn2c(N1)c1nc(nc1n(CC=C)c2=O)-c1cc(OC)nn1C
: