Target
11-beta-hydroxysteroid dehydrogenase type 2
Ligand
BDBM50348309
Substrate
Meas. Tech.
ChEMBL_757492 (CHEMBL1804464)
IC50
2520±n/a nM
Citation
 Wang, HRobl, JAHamann, LGSimpkins, LGolla, RLi, YXSeethala, RZvyaga, TGordon, DALi, JJ Generation of 3,8-substituted 1,2,4-triazolopyridines as potent inhibitors of human 11ß-hydroxysteroid dehydrogenase type 1 (11ß-HSD-1). Bioorg Med Chem Lett 21:4146-9 (2011)  
Target
Name:
11-beta-hydroxysteroid dehydrogenase type 2
Synonyms:
11-DH2 11-beta-Hydroxysteroid Dehydrogenase 2 (11-beta-HSD2) 11-beta-hydroxysteroid dehydrogenase 2 11-beta-hydroxysteroid dehydrogenase type 2 (11-beta-HSD2) DHI2_HUMAN HSD11K SDR9C3
Type:
Enzyme
Mol. Mass.:
44141.72
Organism:
Homo sapiens (Human)
Description:
Purified recombinant human 11beta-HSD2.
Residue:
405
  
Inhibitor
Name:
BDBM50348309
Synonyms:
CHEMBL1800134
Type:
Small organic molecule
Emp. Form.:
C21H22ClN3O2
Mol. Mass.:
383.871
SMILES:
Cc1c(Cl)cccc1Oc1cccn2c(nnc12)C12CCC(O)(CC1)CC2
: