Target
Gastrin/cholecystokinin type B receptor
Ligand
BDBM82235
Substrate
Meas. Tech.
ChEMBL_757943 (CHEMBL1809360)
EC50
0.17±n/a nM
Citation
 Kolenc-Peitl, PMansi, RTamma, MGmeiner-Stopar, TSollner-Dolenc, MWaser, BBaum, RPReubi, JCMaecke, HR Highly improved metabolic stability and pharmacokinetics of indium-111-DOTA-gastrin conjugates for targeting of the gastrin receptor. J Med Chem 54:2602-9 (2011)  
Target
Name:
Gastrin/cholecystokinin type B receptor
Synonyms:
Cckbr Cholecystokinin B receptor GASR_RAT | Gastrin/cholecystokinin type B receptor
Type:
Enzyme Catalytic Domain
Mol. Mass.:
48980.43
Organism:
RAT
Description:
Cholecystokinin A CCKBR RAT::P30553
Residue:
452
  
Inhibitor
Name:
BDBM82235
Synonyms:
Gastrin I Gastrin-I-(1-17)
Type:
Small organic molecule
Emp. Form.:
C94H128N22O31S2
Mol. Mass.:
2126.281
SMILES:
CSCC[C@H](NC(=O)[C@H](Cc1c[nH]c2ccccc12)NC(=O)CNC(=O)[C@H](Cc1ccc(O)cc1)NC(=O)[C@H](C)NC(=O)[C@H](CCC(O)=O)NC(=O)[C@H](CCC(O)=O)NC(=O)[C@H](CCC(O)=O)NC(=O)[C@H](CCC(O)=O)NC(=O)[C@H](CCC(O)=O)NC(=O)[C@H](CCSC)NC(=O)[C@@H]1CCCN1C(=O)[C@@H]1CCCN1C(=O)[C@H](CCCN=C(N)N)NC(=O)[C@@H]1CCC(=O)N1)C(=O)N[C@@H](CC(O)=O)C(=O)N[C@@H](Cc1ccccc1)C(N)=O
: