Target
Dual specificity protein kinase TTK
Ligand
BDBM50349103
Substrate
Meas. Tech.
ChEMBL_757717 (CHEMBL1809661)
IC50
33±n/a nM
Citation
 Caldarelli, MAngiolini, MDisingrini, TDonati, DGuanci, MNuvoloni, SPosteri, HQuartieri, FSilvagni, MColombo, R Synthesis and SAR of new pyrazolo[4,3-h]quinazoline-3-carboxamide derivatives as potent and selective MPS1 kinase inhibitors. Bioorg Med Chem Lett 21:4507-11 (2011)  
Target
Name:
Dual specificity protein kinase TTK
Synonyms:
Dual specificity protein kinase (TTK) MPS1 Monopolar Spindle 1 (MPS1) Monopolar Spindle 1 Kinase (MPS1) TTK | TTK_HUMAN
Type:
Protein
Mol. Mass.:
97086.79
Organism:
Homo sapiens (Human)
Description:
P33981
Residue:
857
  
Inhibitor
Name:
BDBM50349103
Synonyms:
CHEMBL1808341
Type:
Small organic molecule
Emp. Form.:
C33H40N8O3
Mol. Mass.:
596.7225
SMILES:
CCc1cccc(CC)c1NC(=O)c1nn(C)c-2c1CCc1cnc(Nc3ccc(cc3OC)C(=O)NCCN(C)C)nc-21
: