Target
Proto-oncogene tyrosine-protein kinase receptor Ret
Ligand
BDBM50349147
Substrate
Meas. Tech.
ChEMBL_759559 (CHEMBL1811085)
IC50
218±n/a nM
Citation
 Shih, KCShiau, CWChen, TSKo, CHLin, CLLin, CYHwang, CSTang, CYChen, WRHuang, JW Pharmacophore modeling and virtual screening to identify potential RET kinase inhibitors. Bioorg Med Chem Lett 21:4490-7 (2011)  
Target
Name:
Proto-oncogene tyrosine-protein kinase receptor Ret
Synonyms:
CDHF12 Cadherin family member 12 Proto-oncogene c-Ret RET51 Tyrosine-protein kinase Ret (RET)
Type:
Protein
Mol. Mass.:
124318.29
Organism:
Homo sapiens (Human)
Description:
P07949
Residue:
1114
  
Inhibitor
Name:
BDBM50349147
Synonyms:
CHEMBL1807720
Type:
Small organic molecule
Emp. Form.:
C21H15F2N7O2
Mol. Mass.:
435.3863
SMILES:
CNCc1cncc(c1)-c1cnc2[nH]nc(-c3nc4cc5OC(F)(F)Oc5cc4[nH]3)c2c1
: