Target
3-oxoacyl-[acyl-carrier-protein] synthase 3
Ligand
BDBM50349322
Substrate
Meas. Tech.
ChEMBL_760083 (CHEMBL1810406)
Ki
0.00052896±n/a nM
Citation
 Zhang, HJZhu, DDLi, ZLSun, JZhu, HL Synthesis, molecular modeling and biological evaluation ofß-ketoacyl-acyl carrier protein synthase III (FabH) as novel antibacterial agents. Bioorg Med Chem 19:4513-9 (2011)  
Target
Name:
3-oxoacyl-[acyl-carrier-protein] synthase 3
Synonyms:
3-oxoacyl-[acyl-carrier-protein] synthase 3-oxoacyl-[acyl-carrier-protein] synthase III | Beta-ketoacyl-ACP synthase III (FabH)
Type:
Enzyme
Mol. Mass.:
33506.68
Organism:
Escherichia coli
Description:
C3TDZ2
Residue:
317
  
Inhibitor
Name:
BDBM50349322
Synonyms:
CHEMBL1807924
Type:
Small organic molecule
Emp. Form.:
C16H16BrN3O4
Mol. Mass.:
394.22
SMILES:
CC(Cn1c(C)ncc1[N+]([O-])=O)OC(=O)\C=C\c1ccccc1Br
: