Target
Transmembrane protease serine 11D
Ligand
BDBM50349358
Substrate
Meas. Tech.
ChEMBL_760105 (CHEMBL1810428)
Ki
40±n/a nM
Citation
 Sielaff, FBöttcher-Friebertshäuser, EMeyer, DSaupe, SMVolk, IMGarten, WSteinmetzer, T Development of substrate analogue inhibitors for the human airway trypsin-like protease HAT. Bioorg Med Chem Lett 21:4860-4 (2011)  
Target
Name:
Transmembrane protease serine 11D
Synonyms:
Airway trypsin-like protease TM11D_HUMAN Transmembrane protease serine 11D catalytic chain | Transmembrane protease serine 11D non-catalytic chain
Type:
PROTEIN
Mol. Mass.:
46272.53
Organism:
Homo sapiens (Human)
Description:
ChEMBL_840134
Residue:
418
  
Inhibitor
Name:
BDBM50349358
Synonyms:
CHEMBL1809216
Type:
Small organic molecule
Emp. Form.:
C26H36N6O4S
Mol. Mass.:
528.667
SMILES:
NCCCC[C@@H](NS(=O)(=O)Cc1ccccc1)C(=O)N1CCC[C@H]1C(=O)NCc1ccc(cc1)C(N)=N
: