Target
Insulin receptor
Ligand
BDBM50349687
Substrate
Meas. Tech.
ChEMBL_759533 (CHEMBL1811059)
IC50
12±n/a nM
Citation
 Ducray, RSimpson, IJung, FHNissink, JWKenny, PWFitzek, MWalker, GEWard, LTHudson, K Discovery of novel imidazo[1,2-a]pyridines as inhibitors of the insulin-like growth factor-1 receptor tyrosine kinase. Bioorg Med Chem Lett 21:4698-701 (2011)  
Target
Name:
Insulin receptor
Synonyms:
INSR INSR_HUMAN Insulin receptor beta subunit
Type:
Receptor Tyrosine Kinase
Mol. Mass.:
156322.60
Organism:
Homo sapiens (Human)
Description:
P06213
Residue:
1382
  
Inhibitor
Name:
BDBM50349687
Synonyms:
CHEMBL1809044
Type:
Small organic molecule
Emp. Form.:
C24H24ClN7O2
Mol. Mass.:
477.946
SMILES:
COc1cc(ccc1Nc1ncc(Cl)c(n1)-c1cnc2ccccn12)N1CCN(CC1)C(C)=O
: