Target
Peroxisome proliferator-activated receptor gamma
Ligand
BDBM28681
Substrate
Meas. Tech.
ChEMBL_760322 (CHEMBL1815137)
EC50
50±n/a nM
Citation
 Raval, PJain, MGoswami, ABasu, SGite, AGodha, APingali, HRaval, SGiri, SSuthar, DShah, MPatel, P Revisiting glitazars: thiophene substituted oxazole containinga-ethoxy phenylpropanoic acid derivatives as highly potent PPARa/¿ dual agonists devoid of adverse effects in rodents. Bioorg Med Chem Lett 21:3103-9 (2011)  
Target
Name:
Peroxisome proliferator-activated receptor gamma
Synonyms:
NR1C3 PPAR-gamma PPARG_HUMAN Peroxisome proliferator-activated receptor gamma (PPAR gamma) Peroxisome proliferator-activated receptor gamma (PPARĪ³) peroxisome proliferator-activated receptor gamma isoform 2
Type:
Nuclear Receptor
Mol. Mass.:
57613.46
Organism:
Homo sapiens (Human)
Description:
P37231
Residue:
505
  
Inhibitor
Name:
BDBM28681
Synonyms:
5-[(4-{2-[methyl(pyridin-2-yl)amino]ethoxy}phenyl)methyl]-1,3-thiazolidine-2,4-dione BRL 49653 CHEMBL121 [3H]rosiglitazone rosiglitazone
Type:
radiolabeled ligand
Emp. Form.:
C18H19N3O3S
Mol. Mass.:
357.427
SMILES:
CN(CCOc1ccc(Cc2sc(=O)[nH]c2O)cc1)c1ccccn1
: