Target
Carbonic anhydrase 2
Ligand
BDBM50153971
Substrate
Meas. Tech.
ChEMBL_760547 (CHEMBL1815532)
Ki
106±n/a nM
Citation
 Carta, FGaraj, VMaresca, AWagner, JAvvaru, BSRobbins, AHScozzafava, AMcKenna, RSupuran, CT Sulfonamides incorporating 1,3,5-triazine moieties selectively and potently inhibit carbonic anhydrase transmembrane isoforms IX, XII and XIV over cytosolic isoforms I and II: Solution and X-ray crystallographic studies. Bioorg Med Chem 19:3105-19 (2011)  
Target
Name:
Carbonic anhydrase 2
Synonyms:
CA-II CAC Carbonate dehydratase II Carbonic anhydrase 2 (CA-II) Carbonic anhydrase C Carbonic anhydrase II (CA-II) Carbonic anhydrase II (hCA II) | Carbonic anhydrase isoenzyme II (hCA II)
Type:
Enzyme
Mol. Mass.:
29250.71
Organism:
Homo sapiens (Human)
Description:
P00918
Residue:
260
  
Inhibitor
Name:
BDBM50153971
Synonyms:
4-(4,6-Dichloro-[1,3,5]triazin-2-ylamino)-benzenesulfonamide CHEMBL366069
Type:
Small organic molecule
Emp. Form.:
C9H7Cl2N5O2S
Mol. Mass.:
320.155
SMILES:
NS(=O)(=O)c1ccc(Nc2nc(Cl)nc(Cl)n2)cc1
: