Target
Mu-type opioid receptor
Ligand
BDBM50349896
Substrate
Meas. Tech.
ChEMBL_762060 (CHEMBL1816052)
Ki
67±n/a nM
Citation
 Kim, JHDeschamps, JRRothman, RBDersch, CMFolk, JECheng, KJacobson, AERice, KC Probes for narcotic receptor mediated phenomena. Part 42: synthesis and in vitro pharmacological characterization of the N-methyl and N-phenethyl analogues of the racemic ortho-c and para-c oxide-bridged phenylmorphans. Bioorg Med Chem 19:3434-43 (2011)  
Target
Name:
Mu-type opioid receptor
Synonyms:
M-OR-1 MOR-1 MUOR1 Mu opiate receptor OPRM1 hMOP | mu-type opioid receptor isoform MOR-1
Type:
G Protein-Coupled Receptor (GPCR)
Mol. Mass.:
44789.51
Organism:
Homo sapiens (Human)
Description:
P35372
Residue:
400
  
Inhibitor
Name:
BDBM50349896
Synonyms:
CHEMBL1814704
Type:
Small organic molecule
Emp. Form.:
C22H25NO2
Mol. Mass.:
335.4394
SMILES:
Oc1ccc2O[C@@H]3CN(CCc4ccccc4)[C@@H]4CCC[C@]3(C4)c2c1
: