Target
5-hydroxytryptamine receptor 1A
Ligand
BDBM50349937
Substrate
Meas. Tech.
ChEMBL_761423 (CHEMBL1817053)
Ki
42±n/a nM
Citation
 Lewgowd, WBojarski, AJSzczesio, MOlczak, AGlowka, MLMordalski, SStanczak, A Synthesis and structural investigation of some pyrimido[5,4-c]quinolin-4(3H)-one derivatives with a long-chain arylpiperazine moiety as potent 5-HT(1A/2A) and 5-HT(7) receptor ligands. Eur J Med Chem 46:3348-61 (2011)  
Target
Name:
5-hydroxytryptamine receptor 1A
Synonyms:
5-HT-1A 5-HT1A 5-hydroxytryptamine receptor 1A (5HT1A) 5ht1a Htr1a Serotonin 1a (5-HT1a) receptor/Adrenergic receptor alpha-1 | Serotonin receptor 1A
Type:
G Protein-Coupled Receptor (GPCR)
Mol. Mass.:
46445.29
Organism:
Rattus norvegicus (rat)
Description:
Binding assays were performed using rat hippocampal membranes.
Residue:
422
  
Inhibitor
Name:
BDBM50349937
Synonyms:
CHEMBL1812168
Type:
Small organic molecule
Emp. Form.:
C24H25N5O2
Mol. Mass.:
415.4876
SMILES:
COc1ccccc1N1CCN(CCn2cnc3c4ccccc4ncc3c2=O)CC1
: