Target
Dipeptidyl peptidase 8
Ligand
BDBM50350167
Substrate
Meas. Tech.
ChEMBL_761370 (CHEMBL1816908)
Ki
6.5±n/a nM
Citation
 Van Goethem, SMatheeussen, VJoossens, JLambeir, AMChen, XDe Meester, IHaemers, AAugustyns, KVan der Veken, P Structure-activity relationship studies on isoindoline inhibitors of dipeptidyl peptidases 8 and 9 (DPP8, DPP9): is DPP8-selectivity an attainable goal? J Med Chem 54:5737-46 (2011)  
Target
Name:
Dipeptidyl peptidase 8
Synonyms:
DPP8 DPRP-1 Dipeptidyl peptidase 8 (DPP-8) Dipeptidyl peptidase 8/9 Dipeptidyl peptidase VIII Prolyl dipeptidase DPP8
Type:
Enzyme
Mol. Mass.:
103342.62
Organism:
Homo sapiens (Human)
Description:
Q6V1X1
Residue:
898
  
Inhibitor
Name:
BDBM50350167
Synonyms:
CHEMBL1814741
Type:
Small organic molecule
Emp. Form.:
C29H31ClN4O2
Mol. Mass.:
503.035
SMILES:
N[C@@H](CC(=O)N1CCN(CC1)C(c1ccccc1)c1ccc(Cl)cc1)C(=O)N1Cc2ccccc2C1
: