Target
Cholinesterase
Ligand
BDBM50350319
Substrate
Meas. Tech.
ChEMBL_762146 (CHEMBL1816217)
Ki
>100000±n/a nM
Citation
 Parkinson, EIJason Hatfield, MTsurkan, LHyatt, JLEdwards, CCHicks, LDYan, BPotter, PM Requirements for mammalian carboxylesterase inhibition by substituted ethane-1,2-diones. Bioorg Med Chem 19:4635-43 (2011)  
Target
Name:
Cholinesterase
Synonyms:
Acylcholine acylhydrolase Butyrylcholine esterase (BChE) Butyrylcholinesterase (BuChE) CHLE_HUMAN Cholinesterases Pseudocholinesterase
Type:
Homotetramer
Mol. Mass.:
68422.27
Organism:
Homo sapiens (Human)
Description:
P06276
Residue:
602
  
Inhibitor
Name:
BDBM50350319
Synonyms:
CHEMBL1812854
Type:
Small organic molecule
Emp. Form.:
C8H14O2
Mol. Mass.:
142.1956
SMILES:
CCCC(=O)C(=O)CCC
: