Target
Cocaine esterase
Ligand
BDBM50350329
Substrate
Meas. Tech.
ChEMBL_762142 (CHEMBL1816213)
Ki
5.7±n/a nM
Citation
 Parkinson, EIJason Hatfield, MTsurkan, LHyatt, JLEdwards, CCHicks, LDYan, BPotter, PM Requirements for mammalian carboxylesterase inhibition by substituted ethane-1,2-diones. Bioorg Med Chem 19:4635-43 (2011)  
Target
Name:
Cocaine esterase
Synonyms:
CES2 EST2_HUMAN | ICE
Type:
PROTEIN
Mol. Mass.:
61801.08
Organism:
Homo sapiens (Human)
Description:
ChEMBL_1494240
Residue:
559
  
Inhibitor
Name:
BDBM50350329
Synonyms:
CHEMBL1812859
Type:
Small organic molecule
Emp. Form.:
C18H34O2
Mol. Mass.:
282.4614
SMILES:
CCCCCCCCC(=O)C(=O)CCCCCCCC
: