Target
Prostacyclin receptor
Ligand
BDBM50350373
Substrate
Meas. Tech.
ChEMBL_761110 (CHEMBL1815364)
Ki
91±n/a nM
Citation
 Iwahashi, MShimabukuro, AOnoda, TMatsunaga, YOkada, YMatsumoto, RNambu, FNakai, HToda, M Discovery of selective indole-based prostaglandin D2 receptor antagonist. Bioorg Med Chem 19:4574-88 (2011)  
Target
Name:
Prostacyclin receptor
Synonyms:
PGI receptor PRIPR Prostacyclin (IP) Receptor Prostaglandin I Prostaglandin I2 receptor | Prostanoid IP receptor
Type:
G Protein-Coupled Receptor (GPCR)
Mol. Mass.:
40968.22
Organism:
Homo sapiens (Human)
Description:
The membranes prepared from human platelet were used in binding assay.
Residue:
386
  
Inhibitor
Name:
BDBM50350373
Synonyms:
CHEMBL1813124
Type:
Small organic molecule
Emp. Form.:
C28H25ClN2O5
Mol. Mass.:
504.962
SMILES:
CN1C[C@@H](COc2ccc(cc2Cl)C(=O)n2c(C)c(CC(O)=O)c3ccccc23)Oc2ccccc12
: