Target
Carbonic anhydrase 1
Ligand
BDBM10881
Substrate
Meas. Tech.
ChEMBL_762736 (CHEMBL1815987)
pH
7.5±n/a
Ki
50.0±n/a nM
Comments
extracted
Citation
 Nishimori, IMinakuchi, TVullo, DScozzafava, ASupuran, CT Inhibition studies of theß-carbonic anhydrases from the bacterial pathogen Salmonella enterica serovar Typhimurium with sulfonamides and sulfamates. Bioorg Med Chem 19:5023-30 (2011)  
Target
Name:
Carbonic anhydrase 1
Synonyms:
CA-I CAB Carbonate dehydratase I Carbonic anhydrase 1 (CA I) Carbonic anhydrase 1 (Recombinant CA I) Carbonic anhydrase B Carbonic anhydrase I (CA I) Carbonic anhydrase I (CAI) Carbonic anhydrase isoenzyme I (hCA I) | hCA
Type:
Enzyme
Mol. Mass.:
28873.37
Organism:
Homo sapiens (Human)
Description:
P00915
Residue:
261
  
Inhibitor
Name:
BDBM10881
Synonyms:
CHEMBL288100 Methazolamide Methazolamide, MZA Sulfonamide, 2 sulfonamide 2
Type:
Small organic molecule
Emp. Form.:
C5H8N4O3S2
Mol. Mass.:
236.272
SMILES:
CC(=O)N=c1sc(nn1C)S(N)(=O)=O
: