Target
Ectonucleotide pyrophosphatase/phosphodiesterase family member 2
Ligand
BDBM50350720
Substrate
Meas. Tech.
ChEMBL_762854 (CHEMBL1820671)
Ki
834±n/a nM
Citation
 Jiang, GMadan, DPrestwich, GD Aromatic phosphonates inhibit the lysophospholipase D activity of autotaxin. Bioorg Med Chem Lett 21:5098-101 (2011)  
Target
Name:
Ectonucleotide pyrophosphatase/phosphodiesterase family member 2
Synonyms:
ATX Autotaxin (ATX) ENPP2 Ectonucleotide Pyrophosphatase/Phosphodiesterase 2 (ENPP2) Extracellular lysophospholipase D PDNP2
Type:
Enzyme
Mol. Mass.:
99007.13
Organism:
Homo sapiens (Human)
Description:
Q13822
Residue:
863
  
Inhibitor
Name:
BDBM50350720
Synonyms:
CHEMBL1818153
Type:
Small organic molecule
Emp. Form.:
C14H20FNO4P
Mol. Mass.:
316.2856
SMILES:
CCCCCCC(=O)Nc1ccc(cc1)C(F)P(O)([O-])=O
: