Target
Acetyl-CoA carboxylase
Ligand
BDBM50350750
Substrate
Meas. Tech.
ChEMBL_763012 (CHEMBL1820829)
IC50
150±n/a nM
Citation
 Bengtsson, CBlaho, SSaitton, DBBrickmann, KBroddefalk, JDavidsson, ODrmota, TFolmer, RHallberg, KHallén, SHovland, RIsin, EJohannesson, PKull, BLarsson, LOLöfgren, LNilsson, KENoeske, TOakes, NPlowright, ATSchnecke, VStåhlberg, PSörme, PWan, HWellner, EOster, L Design of small molecule inhibitors of acetyl-CoA carboxylase 1 and 2 showing reduction of hepatic malonyl-CoA levels in vivo in obese Zucker rats. Bioorg Med Chem 19:3039-53 (2011)  
Target
Name:
Acetyl-CoA carboxylase
Synonyms:
Acetyl-CoA carboxylase 2 (ACC2) | Acetyl-Coenzyme A carboxylase 2
Type:
Protein
Mol. Mass.:
276278.59
Organism:
Rattus norvegicus (Rat)
Description:
Residue:
2455
  
Inhibitor
Name:
BDBM50350750
Synonyms:
CHEMBL1818300
Type:
Small organic molecule
Emp. Form.:
C33H49N5O4
Mol. Mass.:
579.7733
SMILES:
CC(C)(C)OC(=O)NC[C@H]1CC[C@H](CNC(=O)c2cc(nc3ccccc23)N2CCC(CCN3CC(O)C3)CC2)CC1
: