Target
Vasopressin V1a receptor
Ligand
BDBM50350866
Substrate
Meas. Tech.
ChEMBL_763496 (CHEMBL1819845)
EC50
0.070±n/a nM
Citation
 Wisniewski, KGalyean, RTariga, HAlagarsamy, SCroston, GHeitzmann, JKohan, AWisniewska, HLaporte, RRivière, PJSchteingart, CD New, potent, selective, and short-acting peptidic V1a receptor agonists. J Med Chem 54:4388-98 (2011)  
Target
Name:
Vasopressin V1a receptor
Synonyms:
Avpr1a VASOPRESSIN V1A Vasopressin V1a receptor | Vasopressin receptor
Type:
Enzyme Catalytic Domain
Mol. Mass.:
47674.81
Organism:
RAT
Description:
VASOPRESSIN V1A AVPR1A RAT::P30560
Residue:
424
  
Inhibitor
Name:
BDBM50350866
Synonyms:
CHEMBL1819441
Type:
Small organic molecule
Emp. Form.:
C46H65N15O11S2
Mol. Mass.:
1068.232
SMILES:
[#7]-[#6@H]-1-[#6]-[#16]-[#16]-[#6]-[#6@H](-[#7]-[#6](=O)-[#6@H](-[#6]-[#6](-[#7])=O)-[#7]-[#6](=O)-[#6@H](-[#6]-[#6]-[#6](-[#7])=O)-[#7]-[#6](=O)-[#6@H](-[#6]-c2ccccc2)-[#7]-[#6](=O)-[#6@H](-[#6]-c2ccccc2)-[#7]-[#6]-1=O)-[#6](=O)-[#7]-1-[#6]-[#6]-[#6]-[#6@H]-1-[#6](=O)-[#7]-[#6@@H](-[#6]-[#6]-[#6]\[#7]=[#6](\[#7])-[#7])-[#6](=O)-[#7]-[#6]-[#6](-[#7])=O
: