Target
Vasopressin V1a receptor
Ligand
BDBM50350869
Substrate
Meas. Tech.
ChEMBL_763496 (CHEMBL1819845)
EC50
0.126±n/a nM
Citation
 Wisniewski, KGalyean, RTariga, HAlagarsamy, SCroston, GHeitzmann, JKohan, AWisniewska, HLaporte, RRivière, PJSchteingart, CD New, potent, selective, and short-acting peptidic V1a receptor agonists. J Med Chem 54:4388-98 (2011)  
Target
Name:
Vasopressin V1a receptor
Synonyms:
Avpr1a VASOPRESSIN V1A Vasopressin V1a receptor | Vasopressin receptor
Type:
Enzyme Catalytic Domain
Mol. Mass.:
47674.81
Organism:
RAT
Description:
VASOPRESSIN V1A AVPR1A RAT::P30560
Residue:
424
  
Inhibitor
Name:
BDBM50350869
Synonyms:
CHEMBL1817704
Type:
Small organic molecule
Emp. Form.:
C45H71N13O11S2
Mol. Mass.:
1034.256
SMILES:
CC[C@H](C)[C@@H]1NC(=O)[C@H](Cc2ccccc2)NC(=O)[C@@H](N)CSSC[C@H](NC(=O)[C@H](CC(N)=O)NC(=O)[C@H](CCC(N)=O)NC1=O)C(=O)N1CCC[C@H]1C(=O)N[C@@H](CCCNC(C)C)C(=O)NCC(N)=O
: