Target
Vasopressin V2 receptor
Ligand
BDBM50350884
Substrate
Meas. Tech.
ChEMBL_763492 (CHEMBL1819841)
EC50
>10000±n/a nM
Citation
 Wisniewski, KGalyean, RTariga, HAlagarsamy, SCroston, GHeitzmann, JKohan, AWisniewska, HLaporte, RRivière, PJSchteingart, CD New, potent, selective, and short-acting peptidic V1a receptor agonists. J Med Chem 54:4388-98 (2011)  
Target
Name:
Vasopressin V2 receptor
Synonyms:
ADHR AVPR2 DIR Renal-type arginine vasopressin receptor V2R_HUMAN Vasopressin V2 receptor | Vasopressin receptor
Type:
Receptor
Mol. Mass.:
40295.28
Organism:
Homo sapiens (Human)
Description:
P30518
Residue:
371
  
Inhibitor
Name:
BDBM50350884
Synonyms:
CHEMBL1819551
Type:
Small organic molecule
Emp. Form.:
C35H59N13O11S2
Mol. Mass.:
902.053
SMILES:
CC[C@H](C)[C@@H]1NC(=O)[C@H](C)NC(=O)[C@@H](N)CSSC[C@H](NC(=O)[C@H](CC(N)=O)NC(=O)[C@H](CCC(N)=O)NC1=O)C(=O)N1CCC[C@H]1C(=O)N[C@@H](CCN)C(=O)NCC(N)=O
: