Target
Oxytocin receptor
Ligand
BDBM50350885
Substrate
Meas. Tech.
ChEMBL_763493 (CHEMBL1819842)
EC50
>10000±n/a nM
Citation
 Wisniewski, KGalyean, RTariga, HAlagarsamy, SCroston, GHeitzmann, JKohan, AWisniewska, HLaporte, RRivière, PJSchteingart, CD New, potent, selective, and short-acting peptidic V1a receptor agonists. J Med Chem 54:4388-98 (2011)  
Target
Name:
Oxytocin receptor
Synonyms:
OT-R OXYR_HUMAN | Oxytocin
Type:
Enzyme Catalytic Domain
Mol. Mass.:
42793.26
Organism:
Homo sapiens (Human)
Description:
Oxytocin OXTR HEK293::B2R9L7
Residue:
389
  
Inhibitor
Name:
BDBM50350885
Synonyms:
CHEMBL1819552
Type:
Small organic molecule
Emp. Form.:
C39H67N13O11S2
Mol. Mass.:
958.16
SMILES:
CC[C@H](C)[C@@H]1NC(=O)[C@H](CC(C)(C)C)NC(=O)[C@@H](N)CSSC[C@H](NC(=O)[C@H](CC(N)=O)NC(=O)[C@H](CCC(N)=O)NC1=O)C(=O)N1CCC[C@H]1C(=O)N[C@@H](CCN)C(=O)NCC(N)=O
: