Target
Kappa-type opioid receptor
Ligand
BDBM50350991
Substrate
Meas. Tech.
ChEMBL_763681 (CHEMBL1820306)
Ki
9±n/a nM
Citation
 Verhoest, PRBasak, ASParikh, VHayward, MKauffman, GWParadis, VMcHardy, SFMcLean, SGrimwood, SSchmidt, AWVanase-Frawley, MFreeman, JVan Deusen, JCox, LWong, DLiras, S Design and discovery of a selective small molecule¿ opioid antagonist (2-methyl-N-((2'-(pyrrolidin-1-ylsulfonyl)biphenyl-4-yl)methyl)propan-1-amine, PF-4455242). J Med Chem 54:5868-77 (2011)  
Target
Name:
Kappa-type opioid receptor
Synonyms:
K-OR-1 Kappa-opioid receptor (KOR) Kappa-type opioid receptor (KOR) OPIATE Kappa OPRK1 kappa opioid receptor (KOR)
Type:
G Protein-Coupled Receptor (GPCR)
Mol. Mass.:
42648.76
Organism:
Homo sapiens (Human)
Description:
P41145
Residue:
380
  
Inhibitor
Name:
BDBM50350991
Synonyms:
CHEMBL1818335
Type:
Small organic molecule
Emp. Form.:
C27H30N2O3S
Mol. Mass.:
462.604
SMILES:
O[C@@H]1Cc2ccccc2[C@@H]1NCc1ccc(cc1)-c1ccccc1S(=O)(=O)N1CCCCC1
: