Target
Dihydrofolate reductase
Ligand
BDBM50351174
Substrate
Meas. Tech.
ChEMBL_764179 (CHEMBL1821390)
Ki
0.026±n/a nM
Citation
 Li, XHilgers, MCunningham, MChen, ZTrzoss, MZhang, JKohnen, LLam, TCreighton, CG C, KNelson, KKwan, BStidham, MBrown-Driver, VShaw, KJFinn, J Structure-based design of new DHFR-based antibacterial agents: 7-aryl-2,4-diaminoquinazolines. Bioorg Med Chem Lett 21:5171-6 (2011)  
Target
Name:
Dihydrofolate reductase
Synonyms:
DYR_STAAU Dihydrofolate reductase Tetrahydrofolate dehydrogenase | folA
Type:
Enzyme
Mol. Mass.:
18249.71
Organism:
Staphylococcus aureus
Description:
Residue:
159
  
Inhibitor
Name:
BDBM50351174
Synonyms:
CHEMBL1818128 | US8835445, 31
Type:
Small organic molecule
Emp. Form.:
C21H20N4O
Mol. Mass.:
344.4097
SMILES:
CCOc1ccc2ccccc2c1-c1cc2nc(N)nc(N)c2cc1C
: