Target
Bifunctional epoxide hydrolase 2
Ligand
BDBM25730
Substrate
Meas. Tech.
ChEMBL_763895 (CHEMBL1819920)
IC50
13±n/a nM
Citation
 Brown, JRNorth, EJHurdle, JGMorisseau, CScarborough, JSSun, DKorduláková, JScherman, MSJones, VGrzegorzewicz, ACrew, RMJackson, MMcNeil, MRLee, RE The structure-activity relationship of urea derivatives as anti-tuberculosis agents. Bioorg Med Chem 19:5585-95 (2011)  
Target
Name:
Bifunctional epoxide hydrolase 2
Synonyms:
Cytosolic epoxide hydrolase 2 EPHX2 HYES_HUMAN Soluble epoxide hydrolase (sEH) | epoxide hydrolase 2, cytoplasmic
Type:
Enzyme
Mol. Mass.:
62613.07
Organism:
Homo sapiens (Human)
Description:
P34913
Residue:
555
  
Inhibitor
Name:
BDBM25730
Synonyms:
3-(4-chlorophenyl)-1-(3,4-dichlorophenyl)urea US8815951, 3-(4-chlorophenyl)-1-(3,4-dichlorophenyl)urea cid_7547
Type:
Small organic molecule
Emp. Form.:
C13H9Cl3N2O
Mol. Mass.:
315.582
SMILES:
Clc1ccc(NC(=O)Nc2ccc(Cl)c(Cl)c2)cc1
: