Target
Transcriptional activator protein LasR
Ligand
BDBM50351507
Substrate
Meas. Tech.
ChEMBL_765230 (CHEMBL1827783)
IC50
300000±n/a nM
Citation
 Lowery, CASalzameda, NTSawada, DKaufmann, GFJanda, KD Medicinal chemistry as a conduit for the modulation of quorum sensing. J Med Chem 53:7467-89 (2010)  
Target
Name:
Transcriptional activator protein LasR
Synonyms:
LASR_PSEAE | lasR
Type:
PROTEIN
Mol. Mass.:
26618.24
Organism:
Pseudomonas aeruginosa
Description:
ChEMBL_1475312
Residue:
239
  
Inhibitor
Name:
BDBM50351507
Synonyms:
CHEMBL1823933
Type:
Small organic molecule
Emp. Form.:
C16H24N2O4S
Mol. Mass.:
340.438
SMILES:
O=C(CCCCCCCCN=C=S)CC(=O)N[C@H]1CCOC1=O
: