Target
Transcriptional activator protein LuxR
Ligand
BDBM50351509
Substrate
Meas. Tech.
ChEMBL_765232 (CHEMBL1827785)
IC50
400±n/a nM
Citation
 Lowery, CASalzameda, NTSawada, DKaufmann, GFJanda, KD Medicinal chemistry as a conduit for the modulation of quorum sensing. J Med Chem 53:7467-89 (2010)  
Target
Name:
Transcriptional activator protein LuxR
Synonyms:
LUXR_ALIFS | luxR
Type:
PROTEIN
Mol. Mass.:
28563.86
Organism:
Vibrio fischeri
Description:
ChEMBL_831639
Residue:
250
  
Inhibitor
Name:
BDBM50351509
Synonyms:
CHEMBL8799
Type:
Small organic molecule
Emp. Form.:
C14H25NO3
Mol. Mass.:
255.3532
SMILES:
CCCCCCCCCC(=O)N[C@H]1CCOC1=O
: