Target
Transcriptional activator protein TraR
Ligand
BDBM50351508
Substrate
Meas. Tech.
ChEMBL_765233 (CHEMBL1827786)
IC50
770±n/a nM
Citation
 Lowery, CASalzameda, NTSawada, DKaufmann, GFJanda, KD Medicinal chemistry as a conduit for the modulation of quorum sensing. J Med Chem 53:7467-89 (2010)  
Target
Name:
Transcriptional activator protein TraR
Synonyms:
TRAR_RHIRD | traR
Type:
PROTEIN
Mol. Mass.:
26741.83
Organism:
Rhizobium radiobacter
Description:
ChEMBL_765233
Residue:
234
  
Inhibitor
Name:
BDBM50351508
Synonyms:
CHEMBL259352
Type:
Small organic molecule
Emp. Form.:
C12H21NO3
Mol. Mass.:
227.3
SMILES:
CCCCCCCC(=O)N[C@H]1CCOC1=O
: