Target
Hepatocyte growth factor receptor
Ligand
BDBM50295757
Substrate
Meas. Tech.
ChEMBL_764847 (CHEMBL1826790)
IC50
35±n/a nM
Citation
 Xie, QQZhong, LPan, YLWang, XYZhou, JPDi-Wu, LHuang, QWang, YLYang, LLXie, HZYang, SY Combined SVM-based and docking-based virtual screening for retrieving novel inhibitors of c-Met. Eur J Med Chem 46:3675-80 (2011)  
Target
Name:
Hepatocyte growth factor receptor
Synonyms:
Hepatocyte growth factor receptor Hepatocyte growth factor receptor (c-MET) MET Met proto-oncogene (hepatocyte growth factor receptor) Tyrosine-protein kinase Met (c-Met) c-Met kinase
Type:
Protein
Mol. Mass.:
155559.73
Organism:
Homo sapiens (Human)
Description:
P08581
Residue:
1390
  
Inhibitor
Name:
BDBM50295757
Synonyms:
1-(6-chloroimidazo[2,1-b]thiazol-5-ylsulfonyl)-1H-pyrrolo[3,2-b]pyridine | CHEMBL559926
Type:
Small organic molecule
Emp. Form.:
C12H7ClN4O2S2
Mol. Mass.:
338.793
SMILES:
Clc1nc2sccn2c1S(=O)(=O)n1ccc2ncccc12
: