Target
Hepatocyte growth factor receptor
Ligand
BDBM24485
Substrate
Meas. Tech.
ChEMBL_764847 (CHEMBL1826790)
IC50
80±n/a nM
Citation
 Xie, QQZhong, LPan, YLWang, XYZhou, JPDi-Wu, LHuang, QWang, YLYang, LLXie, HZYang, SY Combined SVM-based and docking-based virtual screening for retrieving novel inhibitors of c-Met. Eur J Med Chem 46:3675-80 (2011)  
Target
Name:
Hepatocyte growth factor receptor
Synonyms:
Hepatocyte growth factor receptor Hepatocyte growth factor receptor (c-MET) MET Met proto-oncogene (hepatocyte growth factor receptor) Tyrosine-protein kinase Met (c-Met) c-Met kinase
Type:
Protein
Mol. Mass.:
155559.73
Organism:
Homo sapiens (Human)
Description:
P08581
Residue:
1390
  
Inhibitor
Name:
BDBM24485
Synonyms:
3-{4-[(6,7-dimethoxyquinolin-4-yl)oxy]-3-fluorophenyl}-1-(2-phenylacetyl)thiourea Inhibitor III
Type:
Small organic molecule
Emp. Form.:
C26H22FN3O4S
Mol. Mass.:
491.534
SMILES:
COc1cc2nccc(Oc3ccc(NC(=S)NC(=O)Cc4ccccc4)cc3F)c2cc1OC
: