Target
Flavin-dependent thymidylate synthase
Ligand
BDBM50351762
Substrate
Meas. Tech.
ChEMBL_764951 (CHEMBL1827108)
IC50
10000±n/a nM
Citation
 Kögler, MVanderhoydonck, BDe Jonghe, SRozenski, JVan Belle, KHerman, JLouat, TParchina, ASibley, CLescrinier, EHerdewijn, P Synthesis and evaluation of 5-substituted 2'-deoxyuridine monophosphate analogues as inhibitors of flavin-dependent thymidylate synthase in Mycobacterium tuberculosis. J Med Chem 54:4847-62 (2011)  
Target
Name:
Flavin-dependent thymidylate synthase
Synonyms:
THYX_MYCTU TSase thyX
Type:
PROTEIN
Mol. Mass.:
27593.46
Organism:
Mycobacterium tuberculosis
Description:
ChEMBL_764951
Residue:
250
  
Inhibitor
Name:
BDBM50351762
Synonyms:
CHEMBL1823494
Type:
Small organic molecule
Emp. Form.:
C15H14FN2O8P
Mol. Mass.:
400.2535
SMILES:
O[C@H]1C[C@@H](O[C@@H]1COP([O-])([O-])=O)n1cc(-c2ccc(F)cc2)c(=O)[nH]c1=O
: