Target
Type-1 angiotensin II receptor
Ligand
BDBM50351801
Substrate
Meas. Tech.
ChEMBL_765494 (CHEMBL1826049)
IC50
3900±n/a nM
Citation
 Deprez-Poulain, RCousaert, NToto, PWilland, NDeprez, B Application of Ullmann and Ullmann-Finkelstein reactions for the synthesis of N-aryl-N-(1H-pyrazol-3-yl) acetamide or N-(1-aryl-1H-pyrazol-3-yl) acetamide derivatives and pharmacological evaluation. Eur J Med Chem 46:3867-76 (2011)  
Target
Name:
Type-1 angiotensin II receptor
Synonyms:
AGTR1 AGTR1B AT1 AT1BR AT2R1B Angiotensin II receptor Type-1 angiotensin II receptor (AT1)
Type:
Protein
Mol. Mass.:
41080.75
Organism:
Homo sapiens (Human)
Description:
P30556
Residue:
359
  
Inhibitor
Name:
BDBM50351801
Synonyms:
CHEMBL1824002
Type:
Small organic molecule
Emp. Form.:
C29H27N7O3
Mol. Mass.:
521.5698
SMILES:
CCOC(=O)c1cn(Cc2ccc(cc2)-c2ccccc2-c2nnn[nH]2)nc1N(C(C)=O)c1ccc(C)cc1
: