Target
Induced myeloid leukemia cell differentiation protein Mcl-1
Ligand
BDBM50336577
Substrate
Meas. Tech.
ChEMBL_765262 (CHEMBL1827901)
Ki
174±n/a nM
Citation
 Zhang, ZYang, HWu, GLi, ZSong, TLi, XQ Probing the difference between BH3 groove of Mcl-1 and Bcl-2 protein: Implications for dual inhibitors design. Eur J Med Chem 46:3909-16 (2011)  
Target
Name:
Induced myeloid leukemia cell differentiation protein Mcl-1
Synonyms:
BCL2L3 Bcl-2-like protein 3 (Mcl-1) Bcl2-L-3 MCL1 Mcl-1 Myeloid cell leukemia sequence 1 (BCL2-related) | mcl1/EAT
Type:
Membrane; Single-pass membrane protein
Mol. Mass.:
37332.87
Organism:
Homo sapiens (Human)
Description:
Q07820
Residue:
350
  
Inhibitor
Name:
BDBM50336577
Synonyms:
3-(p-tolyloxy)-8-oxo-8H-acenaphtho[1,2-b]pyrrole-9-carbonitrile | CHEMBL1672068
Type:
Small organic molecule
Emp. Form.:
C22H12N2O2
Mol. Mass.:
336.3429
SMILES:
Cc1ccc(Oc2ccc3c4c(C#N)c(=O)nc4c4cccc2c34)cc1
: